Swords and Soldiers [NPEA00206]
Started by ps0ne




10 posts in this topic
ps0ne
Member


0
304 posts 59 threads Joined: Oct 2017
12-29-2014, 01:24 PM -
#1
Shows just some rsx textures, log might be interesting. Game makes PPU interpreter fail with error PPU: E {PPU[2949] Thread (threadSavedata)[0x001f4c54]} PPUInterpreter::STW(): invalid address xxxxxxxxxxxxxxxxx
tambre
Guest


 
12-29-2014, 03:39 PM -
#2
(12-29-2014, 01:24 PM)ps0ne Wrote: Shows just some rsx textures, log might be interesting. Game makes PPU interpreter fail with error PPU: E {PPU[2949] Thread (threadSavedata)[0x001f4c54]} PPUInterpreter::STW(): invalid address xxxxxxxxxxxxxxxxx

sys_fs error: "/dev_hdd0/game/NPEA00206/USRDIR/Animations/MENU_BACKGROUND.TXT" not found! flags: 0x00000000

And other errors like that suggest that it's trying to load into the menu but can't find the files...
See if there are any .psarc or other archives and try unpacking them maybe?
ps0ne
Member


0
304 posts 59 threads Joined: Oct 2017
08-29-2015, 08:59 PM -
#3
Error gone. Game definitely goes in menu, maybe further. It looks like loop? second half of log is repeating. There are in log some interesting entries though, like illegal/unknow instructions. RSX debugger shows many garbled textures.
ps0ne
Member


0
304 posts 59 threads Joined: Oct 2017
01-07-2016, 11:52 PM -
#4
Display content with Ogl, Write color buffer, PPULLVM.


LLE spujq and cellsre

Some serious RSX errors appears, for report to developers. Nice for debugging i suppose.
BlackDaemon
Moderator
*****


2
844 posts 374 threads Joined: Aug 2017
01-11-2016, 01:34 AM -
#5
Goes ingame on recent master build. Requires libSre for sound.

http://www.youtube.com/watch?v=ouRxF7XIVrQ
John GodGames
Guest


 
01-12-2016, 12:01 PM -
#6
Tested on recent master or https://github.com/vlj/rpcs3/tree/rsx
I've got this:
Quote:E {rsx::thread} Src type 3 used, please report this to a developer.
E {rsx::thread} FS build failedBig Grin:\RPCS3\FragmentProgram.hlsl(80,70): error X3000: syntax error: unexpected token '.'
D:\RPCS3\FragmentProgram.hlsl(80,66-75): error X3013: 'abs': no matching 0 parameter intrinsic function
D:\RPCS3\FragmentProgram.hlsl(80,66-75): error X3013: Possible intrinsic functions are:
D:\RPCS3\FragmentProgram.hlsl(80,66-75): error X3013: abs(float|half|double|min10float|min16float|int|uint|min12int|min16int|min16uint)
tambre
Guest


 
01-12-2016, 12:22 PM -
#7
(01-12-2016, 12:01 PM)John GodGames Wrote: Tested on recent https://github.com/vlj/rpcs3/tree/rsx
I've got this:
E {rsx::thread} Src type 3 used, please report this to a developer.
E {rsx::thread} FS build failedBig Grin:\RPCS3\FragmentProgram.hlsl(80,70): error X3000: syntax error: unexpected token '.'
D:\RPCS3\FragmentProgram.hlsl(80,66-75): error X3013: 'abs': no matching 0 parameter intrinsic function
D:\RPCS3\FragmentProgram.hlsl(80,66-75): error X3013: Possible intrinsic functions are:
D:\RPCS3\FragmentProgram.hlsl(80,66-75): error X3013: abs(float|half|double|min10float|min16float|int|uint|min12int|min16int|min16uint)

Well, that's on a WIP vlj's development branch. As long it's not on master, it probably ain't worth reporting new problems on other people's development branches.
Also, you should put log snippets or such in quotes.
vlj
Guest


 
01-12-2016, 10:05 PM -
#8
(01-12-2016, 12:01 PM)John GodGames Wrote: Tested on recent master or https://github.com/vlj/rpcs3/tree/rsx
I've got this:
Quote:E {rsx::thread} Src type 3 used, please report this to a developer.
E {rsx::thread} FS build failedBig Grin:\RPCS3\FragmentProgram.hlsl(80,70): error X3000: syntax error: unexpected token '.'
D:\RPCS3\FragmentProgram.hlsl(80,66-75): error X3013: 'abs': no matching 0 parameter intrinsic function
D:\RPCS3\FragmentProgram.hlsl(80,66-75): error X3013: Possible intrinsic functions are:
D:\RPCS3\FragmentProgram.hlsl(80,66-75): error X3013: abs(float|half|double|min10float|min16float|int|uint|min12int|min16int|min16uint)

I can't reproduce here :/ I suspect the bug not being deterministic.
Sometimes fragment shader memory get corrupted (but I have no idea what does this) and thus fragment shader becomes invalid.
Ani
Administrator
*******


10
3,424 posts 94 threads Joined: Aug 2017
02-21-2016, 08:11 PM -
#9
(01-12-2016, 10:05 PM)vlj Wrote:
(01-12-2016, 12:01 PM)John GodGames Wrote: Tested on recent master or https://github.com/vlj/rpcs3/tree/rsx
I've got this:
Quote:E {rsx::thread} Src type 3 used, please report this to a developer.
E {rsx::thread} FS build failedBig Grin:\RPCS3\FragmentProgram.hlsl(80,70): error X3000: syntax error: unexpected token '.'
D:\RPCS3\FragmentProgram.hlsl(80,66-75): error X3013: 'abs': no matching 0 parameter intrinsic function
D:\RPCS3\FragmentProgram.hlsl(80,66-75): error X3013: Possible intrinsic functions are:
D:\RPCS3\FragmentProgram.hlsl(80,66-75): error X3013: abs(float|half|double|min10float|min16float|int|uint|min12int|min16int|min16uint)

I can't reproduce here :/ I suspect the bug not being deterministic.
Sometimes fragment shader memory get corrupted (but I have no idea what does this) and thus fragment shader becomes invalid.

Sometimes that error happens to me, sometimes it gets ingame.
It's spitting out a ridiculous amount of Fragments though.



ps0ne
Member


0
304 posts 59 threads Joined: Oct 2017
06-20-2016, 08:11 PM -
#10
With the improved opengl, game goes in game too.


Forum Jump:


Users browsing this thread: 1 Guest(s)