Hello There, Guest! Register

A-men 2 [NPEB01210]
#1
RPCS3 V0.0.0.6-3945-5672ba8-LLE
This game show intro, show menu and missing graphic(player )Cool

LLE:
cellFiber_Library
cellSail_Library
cellSpursJq_Library
cellSre_Library


Reply
#2
rpcs3-v0.0.0.6-460-g303a109-win_x64

DirectX 12
Gets ingame perfectly with PPU Interpreter 2 and SPU Interpreter 2 but crashes due to.
LLE'd libs indicated in the post above.



Code:
{rsx::thread} RSX: FS build failed:C:\Users\Annie\Desktop\rpcs3_460\FragmentProgram.hlsl(82,18-22): error X3000: syntax error: unexpected token 'break'
C:\Users\Annie\Desktop\rpcs3_460\FragmentProgram.hlsl(82,8-30): error X3013: 'saturate': no matching 1 parameter intrinsic function
C:\Users\Annie\Desktop\rpcs3_460\FragmentProgram.hlsl(82,8-30): error X3013: Possible intrinsic functions are:
C:\Users\Annie\Desktop\rpcs3_460\FragmentProgram.hlsl(82,8-30): error X3013:     saturate(float|half|double|min10float|min16float)

Should an issue be opened?
Reply
#3
(02-09-2016, 09:01 PM)Annie Wrote: rpcs3-v0.0.0.6-460-g303a109-win_x64

DirectX 12
Gets ingame perfectly with PPU Interpreter 2 and SPU Interpreter 2 but crashes due to.
LLE'd libs indicated in the post above.



Code:
{rsx::thread} RSX: FS build failed:C:\Users\Annie\Desktop\rpcs3_460\FragmentProgram.hlsl(82,18-22): error X3000: syntax error: unexpected token 'break'
C:\Users\Annie\Desktop\rpcs3_460\FragmentProgram.hlsl(82,8-30): error X3013: 'saturate': no matching 1 parameter intrinsic function
C:\Users\Annie\Desktop\rpcs3_460\FragmentProgram.hlsl(82,8-30): error X3013: Possible intrinsic functions are:
C:\Users\Annie\Desktop\rpcs3_460\FragmentProgram.hlsl(82,8-30): error X3013:     saturate(float|half|double|min10float|min16float)

Should an issue be opened?

Code:
Unimplemented TEX_SRB instruction: UPB

Not sure, if there already was an issue for that. If not, feel free to open one.
Reply
#4
rpcs3-v0.0.1-2017-02-19-47fdaf69_win64

You can see the characters now, would be playable if not for the broken saves.
Reply
#5
rpcs3-v0.0.2-2017-04-11-18ccd9e4_win64

Saves work now.

Image
Reply


Forum Jump:


Users browsing this thread: 1 Guest(s)