BlackDaemonCrystal Defenders [NPUB30092]
Started by BlackDaemon




5 posts in this topic
BlackDaemon
Moderator
*****


2
844 posts 374 threads Joined: Aug 2017
01-06-2016, 05:58 PM -
#1
Shows some broken graphics on recent master build. "Load Program exception bypass" hack was used.
Code:
...
RSX: E {rsx::thread} Src type 3 used, please report this to a developer.
RSX: E {rsx::thread} Src type 3 used, please report this to a developer.
RSX: E {rsx::thread} FS build failed:D:\rpcs3\FragmentProgram.hlsl(73,77): error X3000: syntax error: unexpected token '.'
D:\rpcs3\FragmentProgram.hlsl(73,54-96): error X3013: 'saturate': no matching 0 parameter intrinsic function
D:\rpcs3\FragmentProgram.hlsl(73,54-96): error X3013: Possible intrinsic functions are:
D:\rpcs3\FragmentProgram.hlsl(73,54-96): error X3013:     saturate(float|half|double|min10float|min16float)


Messages In This Thread
RE: Crystal Defenders [NPUB30092] - by BlackDaemon - 01-06-2016, 05:58 PM
RE: Crystal Defenders [NPUB30092] - by DewQuack - 11-14-2018, 02:51 AM
RE: Crystal Defenders [NPUB30092] - by ssshadow - 07-22-2017, 02:09 PM

Forum Jump:


Users browsing this thread: 1 Guest(s)