Hello There, Guest! Register

A-men 2 [NPEB01210]
#2
rpcs3-v0.0.0.6-460-g303a109-win_x64

DirectX 12
Gets ingame perfectly with PPU Interpreter 2 and SPU Interpreter 2 but crashes due to.
LLE'd libs indicated in the post above.



Code:
{rsx::thread} RSX: FS build failed:C:\Users\Annie\Desktop\rpcs3_460\FragmentProgram.hlsl(82,18-22): error X3000: syntax error: unexpected token 'break'
C:\Users\Annie\Desktop\rpcs3_460\FragmentProgram.hlsl(82,8-30): error X3013: 'saturate': no matching 1 parameter intrinsic function
C:\Users\Annie\Desktop\rpcs3_460\FragmentProgram.hlsl(82,8-30): error X3013: Possible intrinsic functions are:
C:\Users\Annie\Desktop\rpcs3_460\FragmentProgram.hlsl(82,8-30): error X3013:     saturate(float|half|double|min10float|min16float)

Should an issue be opened?
Reply


Messages In This Thread
RE: A-men 2 [NPEB01210] - by AMMAREN - 12-18-2015, 01:21 PM
RE: A-men 2 [NPEB01210] - by Annie - 02-09-2016, 09:01 PM
RE: A-men 2 [NPEB01210] - by tambre - 02-10-2016, 05:45 AM
RE: A-men 2 [NPEB01210] - by digitaldude - 02-20-2017, 02:34 PM
RE: A-men 2 [NPEB01210] - by digitaldude - 04-13-2017, 05:06 PM

Forum Jump:


Users browsing this thread: 1 Guest(s)